Reaction Details
TargetFarnesyl pyrophosphate synthase
LigandBDBM50273716
Substrate/Competitorn/a
Meas. Tech.ChEMBL_538311 (CHEMBL1036745)
IC50 16.1±n/a nM
Citation Simoni, DGebbia, NInvidiata, FPEleopra, MMarchetti, PRondanin, RBaruchello, RProvera, SMarchioro, CTolomeo, MMarinelli, LLimongelli, VNovellino, EKwaasi, ADunford, JBuccheri, SCaccamo, NDieli, F Design, synthesis, and biological evaluation of novel aminobisphosphonates possessing an in vivo antitumor activity through a gammadelta-T lymphocytes-mediated activation mechanism. J Med Chem51:6800-7 (2008) 
 
Farnesyl pyrophosphate synthase
Name:Farnesyl pyrophosphate synthase
Type:Enzyme
Mol. Mass.:48272.89
Organism:Homo sapiens (Human)
Description:P14324
Residue:419
BDBM50273716
NameBDBM50273716
Synonyms:CHEMBL457423 | [2-(Benzoimidazol-1-yl)ethyl]-bisphosphonic acid
TypeSmall organic molecule
Emp. Form.C9H12N2O6P2
Mol. Mass.306.1489
SMILESOP(O)(=O)C(Cn1cnc2ccccc12)P(O)(O)=O