Reaction Details
TargetNeuronal acetylcholine receptor subunit alpha-4
LigandBDBM50275931
Substrate/Competitorn/a
Meas. Tech.ChEMBL_492915 (CHEMBL945303)
Ki 1.2±n/a nM
Citation Murineddu, GMurruzzu, CCurzu, MMChelucci, GGotti, CGaimarri, ALegnani, LToma, LPinna, GA Synthesis of 3,6-diazabicyclo[3.1.1]heptanes as novel ligands for neuronal nicotinic acetylcholine receptors. Bioorg Med Chem Lett18:6147-50 (2008) 
 
Neuronal acetylcholine receptor subunit alpha-4
Name:Neuronal acetylcholine receptor subunit alpha-4
Type:Enzyme
Mol. Mass.:70196.44
Organism:Rattus norvegicus (Rat)
Description:P09483
Residue:630
BDBM50275931
NameBDBM50275931
Synonyms:3-(4-nitrophenyl)-3,6-diazabicyclo[3.1.1]heptane | CHEMBL470366
TypeSmall organic molecule
Emp. Form.C11H13N3O2
Mol. Mass.219.2398
SMILES[O-][N+](=O)c1ccc(cc1)N1CC2CC(C1)N2