Reaction Details
TargetNeuronal acetylcholine receptor subunit alpha-7
LigandBDBM50275879
Substrate/Competitorn/a
Meas. Tech.ChEMBL_492916 (CHEMBL945304)
Ki 1.36±n/a nM
Citation Murineddu, GMurruzzu, CCurzu, MMChelucci, GGotti, CGaimarri, ALegnani, LToma, LPinna, GA Synthesis of 3,6-diazabicyclo[3.1.1]heptanes as novel ligands for neuronal nicotinic acetylcholine receptors. Bioorg Med Chem Lett18:6147-50 (2008) 
 
Neuronal acetylcholine receptor subunit alpha-7
Name:Neuronal acetylcholine receptor subunit alpha-7
Type:Enzyme
Mol. Mass.:56502.44
Organism:Rattus norvegicus (Rat)
Description:Q05941
Residue:502
BDBM50275879
NameBDBM50275879
Synonyms:3-(pyridin-3-yl)-3,6-diazabicyclo[3.1.1]heptane | CHEMBL472243
TypeSmall organic molecule
Emp. Form.C10H13N3
Mol. Mass.175.2303
SMILESC1C2CN(CC1N2)c1cccnc1