Reaction Details
TargetTyrosine-protein kinase ZAP-70
LigandBDBM50275934
Substrate/Competitorn/a
Meas. Tech.ChEMBL_492925 (CHEMBL945313)
Ki 270±n/a nM
Citation Farmer, LJBemis, GBritt, SDCochran, JConnors, MHarrington, EMHoock, TMarkland, WNanthakumar, STaslimi, PTer Haar, EWang, JZhaveri, DSalituro, FG Discovery and SAR of novel 4-thiazolyl-2-phenylaminopyrimidines as potent inhibitors of spleen tyrosine kinase (SYK). Bioorg Med Chem Lett18:6231-5 (2008) 
 
Tyrosine-protein kinase ZAP-70
Name:Tyrosine-protein kinase ZAP-70
Type:Enzyme
Mol. Mass.:69881.61
Organism:Homo sapiens (Human)
Description:ZAP-70 SH2 domain was expressed and purified from E. coli using O-phospho-L-tyrosine-agarose column.
Residue:619
BDBM50275934
NameBDBM50275934
Synonyms:(2-(2-(3,5-dimethylphenylamino)pyrimidin-4-yl)thiazol-5-yl)methanol | CHEMBL511670
TypeSmall organic molecule
Emp. Form.C16H16N4OS
Mol. Mass.312.389
SMILESCc1cc(C)cc(Nc2nccc(n2)-c2ncc(CO)s2)c1