Reaction Details
TargetTyrosine-protein kinase ZAP-70
LigandBDBM50276064
Substrate/Competitorn/a
Meas. Tech.ChEMBL_492925 (CHEMBL945313)
Ki 410±n/a nM
Citation Farmer, LJBemis, GBritt, SDCochran, JConnors, MHarrington, EMHoock, TMarkland, WNanthakumar, STaslimi, PTer Haar, EWang, JZhaveri, DSalituro, FG Discovery and SAR of novel 4-thiazolyl-2-phenylaminopyrimidines as potent inhibitors of spleen tyrosine kinase (SYK). Bioorg Med Chem Lett18:6231-5 (2008) 
 
Tyrosine-protein kinase ZAP-70
Name:Tyrosine-protein kinase ZAP-70
Type:Enzyme
Mol. Mass.:69881.61
Organism:Homo sapiens (Human)
Description:ZAP-70 SH2 domain was expressed and purified from E. coli using O-phospho-L-tyrosine-agarose column.
Residue:619
BDBM50276064
NameBDBM50276064
Synonyms:CHEMBL470780 | N-(3,5-dimethylphenyl)-4-(5-methylthiazol-2-yl)pyrimidin-2-amine
TypeSmall organic molecule
Emp. Form.C16H16N4S
Mol. Mass.296.39
SMILESCc1cnc(s1)-c1ccnc(Nc2cc(C)cc(C)c2)n1