Reaction Details
TargetProto-oncogene tyrosine-protein kinase Src
LigandBDBM50275356
Substrate/Competitorn/a
Meas. Tech.ChEMBL_492924 (CHEMBL945312)
Ki 4000±n/a nM
Citation Farmer, LJBemis, GBritt, SDCochran, JConnors, MHarrington, EMHoock, TMarkland, WNanthakumar, STaslimi, PTer Haar, EWang, JZhaveri, DSalituro, FG Discovery and SAR of novel 4-thiazolyl-2-phenylaminopyrimidines as potent inhibitors of spleen tyrosine kinase (SYK). Bioorg Med Chem Lett18:6231-5 (2008) 
 
Proto-oncogene tyrosine-protein kinase Src
Name:Proto-oncogene tyrosine-protein kinase Src
Type:Protein
Mol. Mass.:59838.60
Organism:Homo sapiens (Human)
Description:P12931
Residue:536
BDBM50275356
NameBDBM50275356
Synonyms:3-(4-(4-(hydroxymethyl)thiazol-2-yl)pyrimidin-2-ylamino)-5-(trifluoromethyl)phenol | CHEMBL485730
TypeSmall organic molecule
Emp. Form.C15H11F3N4O2S
Mol. Mass.368.334
SMILESOCc1csc(n1)-c1ccnc(Nc2cc(O)cc(c2)C(F)(F)F)n1