Reaction Details
TargetProto-oncogene tyrosine-protein kinase Src
LigandBDBM50249318
Substrate/Competitorn/a
Meas. Tech.ChEMBL_492924 (CHEMBL945312)
Ki 3500±n/a nM
Citation Farmer, LJBemis, GBritt, SDCochran, JConnors, MHarrington, EMHoock, TMarkland, WNanthakumar, STaslimi, PTer Haar, EWang, JZhaveri, DSalituro, FG Discovery and SAR of novel 4-thiazolyl-2-phenylaminopyrimidines as potent inhibitors of spleen tyrosine kinase (SYK). Bioorg Med Chem Lett18:6231-5 (2008) 
 
Proto-oncogene tyrosine-protein kinase Src
Name:Proto-oncogene tyrosine-protein kinase Src
Type:Protein
Mol. Mass.:59838.60
Organism:Homo sapiens (Human)
Description:P12931
Residue:536
BDBM50249318
NameBDBM50249318
Synonyms:2-(2-(2-(3,5-dimethylphenylamino)pyrimidin-4-yl)-4-methylthiazol-5-yl)ethanol | CHEMBL471727
TypeSmall organic molecule
Emp. Form.C18H20N4OS
Mol. Mass.340.443
SMILESCc1nc(sc1CCO)-c1ccnc(Nc2cc(C)cc(C)c2)n1