Reaction Details
TargetProto-oncogene tyrosine-protein kinase Src
LigandBDBM50276018
Substrate/Competitorn/a
Meas. Tech.ChEMBL_492924 (CHEMBL945312)
Ki 862±n/a nM
Citation Farmer, LJBemis, GBritt, SDCochran, JConnors, MHarrington, EMHoock, TMarkland, WNanthakumar, STaslimi, PTer Haar, EWang, JZhaveri, DSalituro, FG Discovery and SAR of novel 4-thiazolyl-2-phenylaminopyrimidines as potent inhibitors of spleen tyrosine kinase (SYK). Bioorg Med Chem Lett18:6231-5 (2008) 
 
Proto-oncogene tyrosine-protein kinase Src
Name:Proto-oncogene tyrosine-protein kinase Src
Type:Protein
Mol. Mass.:59838.60
Organism:Homo sapiens (Human)
Description:P12931
Residue:536
BDBM50276018
NameBDBM50276018
Synonyms:1-(3-(cyclopenta-1,3-dienyl)benzyl)-3,5-diethylbenzene | CHEMBL472478
TypeSmall organic molecule
Emp. Form.C15H14N4O2S
Mol. Mass.314.362
SMILESCOc1cc(Nc2nccc(n2)-c2nccs2)cc(OC)c1