Reaction Details
TargetCyclin-dependent kinase 2
LigandBDBM50275356
Substrate/Competitorn/a
Meas. Tech.ChEMBL_492922 (CHEMBL945310)
Ki 1500±n/a nM
Citation Farmer, LJBemis, GBritt, SDCochran, JConnors, MHarrington, EMHoock, TMarkland, WNanthakumar, STaslimi, PTer Haar, EWang, JZhaveri, DSalituro, FG Discovery and SAR of novel 4-thiazolyl-2-phenylaminopyrimidines as potent inhibitors of spleen tyrosine kinase (SYK). Bioorg Med Chem Lett18:6231-5 (2008) 
 
Cyclin-dependent kinase 2
Name:Cyclin-dependent kinase 2
Type:Enzyme Subunit
Mol. Mass.:33938.17
Organism:Homo sapiens (Human)
Description:P24941
Residue:298
BDBM50275356
NameBDBM50275356
Synonyms:3-(4-(4-(hydroxymethyl)thiazol-2-yl)pyrimidin-2-ylamino)-5-(trifluoromethyl)phenol | CHEMBL485730
TypeSmall organic molecule
Emp. Form.C15H11F3N4O2S
Mol. Mass.368.334
SMILESOCc1csc(n1)-c1ccnc(Nc2cc(O)cc(c2)C(F)(F)F)n1