Reaction Details
TargetCyclin-dependent kinase 2
LigandBDBM50276064
Substrate/Competitorn/a
Meas. Tech.ChEMBL_492922 (CHEMBL945310)
Ki 1100±n/a nM
Citation Farmer, LJBemis, GBritt, SDCochran, JConnors, MHarrington, EMHoock, TMarkland, WNanthakumar, STaslimi, PTer Haar, EWang, JZhaveri, DSalituro, FG Discovery and SAR of novel 4-thiazolyl-2-phenylaminopyrimidines as potent inhibitors of spleen tyrosine kinase (SYK). Bioorg Med Chem Lett18:6231-5 (2008) 
 
Cyclin-dependent kinase 2
Name:Cyclin-dependent kinase 2
Type:Enzyme Subunit
Mol. Mass.:33938.17
Organism:Homo sapiens (Human)
Description:P24941
Residue:298
BDBM50276064
NameBDBM50276064
Synonyms:CHEMBL470780 | N-(3,5-dimethylphenyl)-4-(5-methylthiazol-2-yl)pyrimidin-2-amine
TypeSmall organic molecule
Emp. Form.C16H16N4S
Mol. Mass.296.39
SMILESCc1cnc(s1)-c1ccnc(Nc2cc(C)cc(C)c2)n1