Reaction Details
TargetTyrosine-protein kinase SYK
LigandBDBM50249286
Substrate/Competitorn/a
Meas. Tech.ChEMBL_492921 (CHEMBL945309)
Ki 26±n/a nM
Citation Farmer, LJBemis, GBritt, SDCochran, JConnors, MHarrington, EMHoock, TMarkland, WNanthakumar, STaslimi, PTer Haar, EWang, JZhaveri, DSalituro, FG Discovery and SAR of novel 4-thiazolyl-2-phenylaminopyrimidines as potent inhibitors of spleen tyrosine kinase (SYK). Bioorg Med Chem Lett18:6231-5 (2008) 
 
Tyrosine-protein kinase SYK
Name:Tyrosine-protein kinase SYK
Type:Enzyme
Mol. Mass.:72079.99
Organism:Homo sapiens (Human)
Description:P43405
Residue:635
BDBM50249286
NameBDBM50249286
Synonyms:3-(3-(4-(thiazol-2-yl)pyrimidin-2-ylamino)-5-(trifluoromethyl)phenoxy)propan-1-ol | CHEMBL475254
TypeSmall organic molecule
Emp. Form.C17H15F3N4O2S
Mol. Mass.396.387
SMILESOCCCOc1cc(Nc2nccc(n2)-c2nccs2)cc(c1)C(F)(F)F