Reaction Details
TargetTyrosine-protein kinase SYK
LigandBDBM50249258
Substrate/Competitorn/a
Meas. Tech.ChEMBL_492921 (CHEMBL945309)
Ki 1817±n/a nM
Citation Farmer, LJBemis, GBritt, SDCochran, JConnors, MHarrington, EMHoock, TMarkland, WNanthakumar, STaslimi, PTer Haar, EWang, JZhaveri, DSalituro, FG Discovery and SAR of novel 4-thiazolyl-2-phenylaminopyrimidines as potent inhibitors of spleen tyrosine kinase (SYK). Bioorg Med Chem Lett18:6231-5 (2008) 
 
Tyrosine-protein kinase SYK
Name:Tyrosine-protein kinase SYK
Type:Enzyme
Mol. Mass.:72079.99
Organism:Homo sapiens (Human)
Description:P43405
Residue:635
BDBM50249258
NameBDBM50249258
Synonyms:CHEMBL475570 | N-(2,5-dimethylphenyl)-4-(thiazol-2-yl)pyrimidin-2-amine
TypeSmall organic molecule
Emp. Form.C15H14N4S
Mol. Mass.282.363
SMILESCc1ccc(C)c(Nc2nccc(n2)-c2nccs2)c1