Reaction Details
TargetTyrosine-protein kinase SYK
LigandBDBM50249226
Substrate/Competitorn/a
Meas. Tech.ChEMBL_492921 (CHEMBL945309)
Ki 630±n/a nM
Citation Farmer, LJBemis, GBritt, SDCochran, JConnors, MHarrington, EMHoock, TMarkland, WNanthakumar, STaslimi, PTer Haar, EWang, JZhaveri, DSalituro, FG Discovery and SAR of novel 4-thiazolyl-2-phenylaminopyrimidines as potent inhibitors of spleen tyrosine kinase (SYK). Bioorg Med Chem Lett18:6231-5 (2008) 
 
Tyrosine-protein kinase SYK
Name:Tyrosine-protein kinase SYK
Type:Enzyme
Mol. Mass.:72079.99
Organism:Homo sapiens (Human)
Description:P43405
Residue:635
BDBM50249226
NameBDBM50249226
Synonyms:CHEMBL513985 | N-(3-phenoxyphenyl)-4-(thiazol-2-yl)pyrimidin-2-amine
TypeSmall organic molecule
Emp. Form.C19H14N4OS
Mol. Mass.346.406
SMILESN(c1cccc(Oc2ccccc2)c1)c1nccc(n1)-c1nccs1