Reaction Details
TargetTyrosine-protein kinase SYK
LigandBDBM50276065
Substrate/Competitorn/a
Meas. Tech.ChEMBL_492926 (CHEMBL945314)
IC50 50±n/a nM
Citation Farmer, LJBemis, GBritt, SDCochran, JConnors, MHarrington, EMHoock, TMarkland, WNanthakumar, STaslimi, PTer Haar, EWang, JZhaveri, DSalituro, FG Discovery and SAR of novel 4-thiazolyl-2-phenylaminopyrimidines as potent inhibitors of spleen tyrosine kinase (SYK). Bioorg Med Chem Lett18:6231-5 (2008) 
 
Tyrosine-protein kinase SYK
Name:Tyrosine-protein kinase SYK
Type:Enzyme
Mol. Mass.:72079.99
Organism:Homo sapiens (Human)
Description:P43405
Residue:635
BDBM50276065
NameBDBM50276065
Synonyms:(2-(2-(3,5-dimethylphenylamino)pyrimidin-4-yl)thiazol-4-yl)methanol | CHEMBL511811
TypeSmall organic molecule
Emp. Form.C16H16N4OS
Mol. Mass.312.389
SMILESCc1cc(C)cc(Nc2nccc(n2)-c2nc(CO)cs2)c1