Reaction Details
TargetTyrosine-protein kinase ZAP-70
LigandBDBM50249540
Substrate/Competitorn/a
Meas. Tech.ChEMBL_492925 (CHEMBL945313)
Ki 1500±n/a nM
Citation Farmer, LJBemis, GBritt, SDCochran, JConnors, MHarrington, EMHoock, TMarkland, WNanthakumar, STaslimi, PTer Haar, EWang, JZhaveri, DSalituro, FG Discovery and SAR of novel 4-thiazolyl-2-phenylaminopyrimidines as potent inhibitors of spleen tyrosine kinase (SYK). Bioorg Med Chem Lett18:6231-5 (2008) 
 
Tyrosine-protein kinase ZAP-70
Name:Tyrosine-protein kinase ZAP-70
Type:Enzyme
Mol. Mass.:69881.61
Organism:Homo sapiens (Human)
Description:ZAP-70 SH2 domain was expressed and purified from E. coli using O-phospho-L-tyrosine-agarose column.
Residue:619
BDBM50249540
NameBDBM50249540
Synonyms:(R)-2-(2-(3,5-dimethylphenylamino)pyrimidin-4-yl)-N-(1-hydroxypropan-2-yl)-4-methylthiazole-5-carboxamide | CHEMBL473229
TypeSmall organic molecule
Emp. Form.C20H23N5O2S
Mol. Mass.397.494
SMILESC[C@H](CO)NC(=O)c1sc(nc1C)-c1ccnc(Nc2cc(C)cc(C)c2)n1