Reaction Details
TargetAdenosine receptor A2b
LigandBDBM50273839
Substrate/Competitorn/a
Meas. Tech.ChEMBL_538313 (CHEMBL1036747)
Ki 54±n/a nM
Citation Stefanachi, ANicolotti, OLeonetti, FCellamare, SCampagna, FLoza, MIBrea, JMMazza, FGavuzzo, ECarotti, A 1,3-Dialkyl-8-(hetero)aryl-9-OH-9-deazaxanthines as potent A2B adenosine receptor antagonists: design, synthesis, structure-affinity and structure-selectivity relationships. Bioorg Med Chem16:9780-9 (2008) 
 
Adenosine receptor A2b
Name:Adenosine receptor A2b
Type:G Protein-Coupled Receptor (GPCR)
Mol. Mass.:36341.22
Organism:Homo sapiens (Human)
Description:n/a
Residue:332
BDBM50273839
NameBDBM50273839
Synonyms:7-hydroxy-6-phenyl-1,3-dipropyl-1H-pyrrolo[3,2-d]pyrimidine-2,4(3H,5H)-dione | CHEMBL516154
TypeSmall organic molecule
Emp. Form.C18H21N3O3
Mol. Mass.327.3776
SMILESCCCn1c2c(O)c([nH]c2c(=O)n(CCC)c1=O)-c1ccccc1