Reaction Details
TargetAdenosine receptor A2b
LigandBDBM50273954
Substrate/Competitorn/a
Meas. Tech.ChEMBL_538313 (CHEMBL1036747)
Ki 71±n/a nM
Citation Stefanachi, ANicolotti, OLeonetti, FCellamare, SCampagna, FLoza, MIBrea, JMMazza, FGavuzzo, ECarotti, A 1,3-Dialkyl-8-(hetero)aryl-9-OH-9-deazaxanthines as potent A2B adenosine receptor antagonists: design, synthesis, structure-affinity and structure-selectivity relationships. Bioorg Med Chem16:9780-9 (2008) 
 
Adenosine receptor A2b
Name:Adenosine receptor A2b
Type:G Protein-Coupled Receptor (GPCR)
Mol. Mass.:36341.22
Organism:Homo sapiens (Human)
Description:n/a
Residue:332
BDBM50273954
NameBDBM50273954
Synonyms:6-(4-acetylphenyl)-7-hydroxy-1,3-dipropyl-1H-pyrrolo[3,2-d]pyrimidine-2,4(3H,5H)-dione | CHEMBL456816
TypeSmall organic molecule
Emp. Form.C20H23N3O4
Mol. Mass.369.4143
SMILESCCCn1c2c(O)c([nH]c2c(=O)n(CCC)c1=O)-c1ccc(cc1)C(C)=O