Reaction Details
TargetAdenosine receptor A2b
LigandBDBM50273310
Substrate/Competitorn/a
Meas. Tech.ChEMBL_538313 (CHEMBL1036747)
Ki 35±n/a nM
Citation Stefanachi, ANicolotti, OLeonetti, FCellamare, SCampagna, FLoza, MIBrea, JMMazza, FGavuzzo, ECarotti, A 1,3-Dialkyl-8-(hetero)aryl-9-OH-9-deazaxanthines as potent A2B adenosine receptor antagonists: design, synthesis, structure-affinity and structure-selectivity relationships. Bioorg Med Chem16:9780-9 (2008) 
 
Adenosine receptor A2b
Name:Adenosine receptor A2b
Type:G Protein-Coupled Receptor (GPCR)
Mol. Mass.:36341.22
Organism:Homo sapiens (Human)
Description:n/a
Residue:332
BDBM50273310
NameBDBM50273310
Synonyms:6-(2-Furyl)-2,4dioxo-1,3-dipropyl-2,3,4,5-tetrahydro-1H-pyrrolo[3,2-d]pyrimidin-7-yl hydrogen sulfate | CHEMBL508090
TypeSmall organic molecule
Emp. Form.C16H19N3O7S
Mol. Mass.397.403
SMILESCCCn1c2c(OS(O)(=O)=O)c([nH]c2c(=O)n(CCC)c1=O)-c1ccco1