Reaction Details
TargetAdenosine receptor A2b
LigandBDBM50240999
Substrate/Competitorn/a
Meas. Tech.ChEMBL_538313 (CHEMBL1036747)
Ki 2.2±n/a nM
Citation Stefanachi, ANicolotti, OLeonetti, FCellamare, SCampagna, FLoza, MIBrea, JMMazza, FGavuzzo, ECarotti, A 1,3-Dialkyl-8-(hetero)aryl-9-OH-9-deazaxanthines as potent A2B adenosine receptor antagonists: design, synthesis, structure-affinity and structure-selectivity relationships. Bioorg Med Chem16:9780-9 (2008) 
 
Adenosine receptor A2b
Name:Adenosine receptor A2b
Type:G Protein-Coupled Receptor (GPCR)
Mol. Mass.:36341.22
Organism:Homo sapiens (Human)
Description:n/a
Residue:332
BDBM50240999
NameBDBM50240999
Synonyms:CHEMBL201145 | N-(4-bromophenyl)-2-(4-(2,4-dioxo-1,3-dipropyl-2,3,4,5-tetrahydro-1H-pyrrolo[3,2-d]pyrimidin-6-yl)phenoxy)acetamide
TypeSmall organic molecule
Emp. Form.C26H27BrN4O4
Mol. Mass.539.421
SMILESCCCn1c2cc([nH]c2c(=O)n(CCC)c1=O)-c1ccc(OCC(=O)Nc2ccc(Br)cc2)cc1