Reaction Details
TargetAdenosine receptor A1
LigandBDBM50273956
Substrate/Competitorn/a
Meas. Tech.ChEMBL_538317 (CHEMBL1036751)
Ki 63±n/a nM
Citation Stefanachi, ANicolotti, OLeonetti, FCellamare, SCampagna, FLoza, MIBrea, JMMazza, FGavuzzo, ECarotti, A 1,3-Dialkyl-8-(hetero)aryl-9-OH-9-deazaxanthines as potent A2B adenosine receptor antagonists: design, synthesis, structure-affinity and structure-selectivity relationships. Bioorg Med Chem16:9780-9 (2008) 
 
Adenosine receptor A1
Name:Adenosine receptor A1
Type:G Protein-Coupled Receptor (GPCR)
Mol. Mass.:36520.92
Organism:Homo sapiens (Human)
Description:P30542
Residue:326
BDBM50273956
NameBDBM50273956
Synonyms:7-hydroxy-6-(4-(methylsulfonyl)phenyl)-1,3-dipropyl-1H-pyrrolo[3,2-d]pyrimidine-2,4(3H,5H)-dione | CHEMBL507754
TypeSmall organic molecule
Emp. Form.C19H23N3O5S
Mol. Mass.405.468
SMILESCCCn1c2c(O)c([nH]c2c(=O)n(CCC)c1=O)-c1ccc(cc1)S(C)(=O)=O