Reaction Details
TargetAdenosine receptor A3
LigandBDBM50273311
Substrate/Competitorn/a
Meas. Tech.ChEMBL_538318 (CHEMBL1036752)
Ki 1290±n/a nM
Citation Stefanachi, ANicolotti, OLeonetti, FCellamare, SCampagna, FLoza, MIBrea, JMMazza, FGavuzzo, ECarotti, A 1,3-Dialkyl-8-(hetero)aryl-9-OH-9-deazaxanthines as potent A2B adenosine receptor antagonists: design, synthesis, structure-affinity and structure-selectivity relationships. Bioorg Med Chem16:9780-9 (2008) 
 
Adenosine receptor A3
Name:Adenosine receptor A3
Type:G Protein-Coupled Receptor (GPCR)
Mol. Mass.:36197.32
Organism:Homo sapiens (Human)
Description:P0DMS8
Residue:318
BDBM50273311
NameBDBM50273311
Synonyms:CHEMBL456125 | N-(4-bromophenyl)-2-(4-(7-hydroxy-2,4-dioxo-1,3-dipropyl-2,3,4,5-tetrahydro-1H-pyrrolo[3,2-d]pyrimidin-6-yl)phenoxy)acetamide
TypeSmall organic molecule
Emp. Form.C26H27BrN4O5
Mol. Mass.555.42
SMILESCCCn1c2c(O)c([nH]c2c(=O)n(CCC)c1=O)-c1ccc(OCC(=O)Nc2ccc(Br)cc2)cc1