Reaction Details
TargetAdenosine receptor A2a
LigandBDBM50273958
Substrate/Competitorn/a
Meas. Tech.ChEMBL_538314 (CHEMBL1036748)
Ki 104±n/a nM
Citation Stefanachi, ANicolotti, OLeonetti, FCellamare, SCampagna, FLoza, MIBrea, JMMazza, FGavuzzo, ECarotti, A 1,3-Dialkyl-8-(hetero)aryl-9-OH-9-deazaxanthines as potent A2B adenosine receptor antagonists: design, synthesis, structure-affinity and structure-selectivity relationships. Bioorg Med Chem16:9780-9 (2008) 
 
Adenosine receptor A2a
Name:Adenosine receptor A2a
Type:G Protein-Coupled Receptor (GPCR)
Mol. Mass.:44716.46
Organism:Homo sapiens (Human)
Description:P29274
Residue:412
BDBM50273958
NameBDBM50273958
Synonyms:6-(furan-2-yl)-7-hydroxy-1,3-dipropyl-1H-pyrrolo[3,2-d]pyrimidine-2,4(3H,5H)-dione | CHEMBL454700
TypeSmall organic molecule
Emp. Form.C16H19N3O4
Mol. Mass.317.3398
SMILESCCCn1c2c(O)c([nH]c2c(=O)n(CCC)c1=O)-c1ccco1