Reaction Details
TargetBone morphogenetic protein 1
LigandBDBM50256368
Substrate/Competitorn/a
Meas. Tech.ChEMBL_518962 (CHEMBL941550)
IC50 17±n/a nM
Citation Bailey, SFish, PVBillotte, SBordner, JGreiling, DJames, KMcElroy, AMills, JEReed, CWebster, R Succinyl hydroxamates as potent and selective non-peptidic inhibitors of procollagen C-proteinase: design, synthesis, and evaluation as topically applied, dermal anti-scarring agents. Bioorg Med Chem Lett18:6562-7 (2008) 
 
Bone morphogenetic protein 1
Name:Bone morphogenetic protein 1
Type:PROTEIN
Mol. Mass.:111254.03
Organism:Homo sapiens (Human)
Description:ChEMBL_518962
Residue:986
BDBM50256368
NameBDBM50256368
Synonyms:(R)-2-(6-cyclohexyl-1-(hydroxyamino)-1-oxohexan-3-yl)-N,N,5-trimethyloxazole-4-carboxamide | CHEMBL482327
TypeSmall organic molecule
Emp. Form.C19H31N3O4
Mol. Mass.365.4671
SMILESCN(C)C(=O)c1nc(oc1C)[C@H](CCCC1CCCCC1)CC(=O)NO