Reaction Details
TargetCalcitonin gene-related peptide type 1 receptor
LigandBDBM50246084
Substrate/Competitorn/a
Meas. Tech.ChEMBL_558102 (CHEMBL956592)
Ki 5.5±n/a nM
Citation Theberge, CRBednar, RABell, IMCorcoran, HAFay, JFHershey, JCJohnston, VKKane, SAMosser, SSalvatore, CAWilliams, TMZartman, CBZhang, XFGraham, SLVacca, JP Potent benzimidazolone-based CGRP receptor antagonists. Bioorg Med Chem Lett18:6122-5 (2008) 
 
Calcitonin gene-related peptide type 1 receptor
Name:Calcitonin gene-related peptide type 1 receptor
Type:Enzyme Catalytic Domain
Mol. Mass.:52980.45
Organism:Homo sapiens (Human)
Description:Q16602
Residue:461
BDBM50246084
NameBDBM50246084
Synonyms:(R)-2-(4,6-dimethyl-2-oxo-2,3-dihydro-1H-benzo[d]imidazol-1-yl)-N-(3-methyl-2,5-dioxo-1',3'-dihydrospiro[imidazolidine-4,2'-indene]-5'-yl)acetamide | CHEMBL471358
TypeSmall organic molecule
Emp. Form.C23H23N5O4
Mol. Mass.433.4598
SMILESCN1C(=O)NC(=O)[C@]11Cc2ccc(NC(=O)Cn3c4cc(C)cc(C)c4[nH]c3=O)cc2C1