Reaction Details
TargetCalcitonin gene-related peptide type 1 receptor
LigandBDBM50246176
Substrate/Competitorn/a
Meas. Tech.ChEMBL_558102 (CHEMBL956592)
Ki 62±n/a nM
Citation Theberge, CRBednar, RABell, IMCorcoran, HAFay, JFHershey, JCJohnston, VKKane, SAMosser, SSalvatore, CAWilliams, TMZartman, CBZhang, XFGraham, SLVacca, JP Potent benzimidazolone-based CGRP receptor antagonists. Bioorg Med Chem Lett18:6122-5 (2008) 
 
Calcitonin gene-related peptide type 1 receptor
Name:Calcitonin gene-related peptide type 1 receptor
Type:Enzyme Catalytic Domain
Mol. Mass.:52980.45
Organism:Homo sapiens (Human)
Description:Q16602
Residue:461
BDBM50246176
NameBDBM50246176
Synonyms:(R)-2-(5-methoxy-2-oxo-2,3-dihydro-1H-benzo[d]imidazol-1-yl)-N-(3-methyl-2,5-dioxo-1',3'-dihydrospiro[imidazolidine-4,2'-indene]-5'-yl)acetamide | CHEMBL519242
TypeSmall organic molecule
Emp. Form.C22H21N5O5
Mol. Mass.435.4326
SMILESCOc1ccc2n(CC(=O)Nc3ccc4C[C@]5(Cc4c3)N(C)C(=O)NC5=O)c(=O)[nH]c2c1