Reaction Details
TargetCalcitonin gene-related peptide type 1 receptor
LigandBDBM50246422
Substrate/Competitorn/a
Meas. Tech.ChEMBL_558102 (CHEMBL956592)
Ki 0.51±n/a nM
Citation Theberge, CRBednar, RABell, IMCorcoran, HAFay, JFHershey, JCJohnston, VKKane, SAMosser, SSalvatore, CAWilliams, TMZartman, CBZhang, XFGraham, SLVacca, JP Potent benzimidazolone-based CGRP receptor antagonists. Bioorg Med Chem Lett18:6122-5 (2008) 
 
Calcitonin gene-related peptide type 1 receptor
Name:Calcitonin gene-related peptide type 1 receptor
Type:Enzyme Catalytic Domain
Mol. Mass.:52980.45
Organism:Homo sapiens (Human)
Description:Q16602
Residue:461
BDBM50246422
NameBDBM50246422
Synonyms:(R)-2-(2,5-dioxo-2,4,5,6-tetrahydro-1H-imidazo[1,5,4-de]quinoxalin-1-yl)-N-(3-methyl-2,5-dioxo-1',3'-dihydrospiro[imidazolidine-4,2'-indene]-5'-yl)acetamide | CHEMBL453643
TypeSmall organic molecule
Emp. Form.C23H20N6O5
Mol. Mass.460.4421
SMILESCN1C(=O)NC(=O)[C@]11Cc2ccc(NC(=O)Cn3c4cccc5NC(=O)Cn(c45)c3=O)cc2C1