Reaction Details
TargetPeroxisome proliferator-activated receptor delta
LigandBDBM28706
Substrate/Competitorn/a
Meas. Tech.ChEMBL_558111 (CHEMBL959040)
EC50 2830±n/a nM
Citation Martres, PFaucher, NLaroze, APineau, OFouchet, MHPotvain, FGrillot, DBeneton, V The discovery of equipotent PPARalpha/gamma dual activators. Bioorg Med Chem Lett18:6251-4 (2008) 
 
Peroxisome proliferator-activated receptor delta
Name:Peroxisome proliferator-activated receptor delta
Type:Enzyme
Mol. Mass.:49910.45
Organism:Homo sapiens (Human)
Description:Q03181
Residue:441
BDBM28706
NameBDBM28706
Synonyms:2-methyl-2-phenoxypropanoic acid, 25a CHEMBL219586
TypeSmall organic molecule
Emp. Form.C23H21F3N2O4S
Mol. Mass.478.484
SMILESCc1nc(sc1C(=O)NCc1ccc(OC(C)(C)C(O)=O)cc1)-c1ccc(cc1)C(F)(F)F