Reaction Details
TargetPeroxisome proliferator-activated receptor delta
LigandBDBM50246525
Substrate/Competitorn/a
Meas. Tech.ChEMBL_558114 (CHEMBL959043)
EC50>25000±n/a nM
Citation Martres, PFaucher, NLaroze, APineau, OFouchet, MHPotvain, FGrillot, DBeneton, V The discovery of equipotent PPARalpha/gamma dual activators. Bioorg Med Chem Lett18:6251-4 (2008) 
 
Peroxisome proliferator-activated receptor delta
Name:Peroxisome proliferator-activated receptor delta
Type:PROTEIN
Mol. Mass.:49719.14
Organism:Mus musculus
Description:ChEMBL_1288931
Residue:440
BDBM50246525
NameBDBM50246525
Synonyms:2-(4-((5-(4-tert-butylphenyl)-1-methyl-1H-pyrazole-3-carboxamido)methyl)-2-methylphenoxy)-2-methylpropanoic acid | CHEMBL518348
TypeSmall organic molecule
Emp. Form.C27H33N3O4
Mol. Mass.463.5686
SMILESCc1cc(CNC(=O)c2cc(-c3ccc(cc3)C(C)(C)C)n(C)n2)ccc1OC(C)(C)C(O)=O