Reaction Details
TargetPeroxisome proliferator-activated receptor delta
LigandBDBM50245782
Substrate/Competitorn/a
Meas. Tech.ChEMBL_558114 (CHEMBL959043)
EC50 7100±n/a nM
Citation Martres, PFaucher, NLaroze, APineau, OFouchet, MHPotvain, FGrillot, DBeneton, V The discovery of equipotent PPARalpha/gamma dual activators. Bioorg Med Chem Lett18:6251-4 (2008) 
 
Peroxisome proliferator-activated receptor delta
Name:Peroxisome proliferator-activated receptor delta
Type:PROTEIN
Mol. Mass.:49719.14
Organism:Mus musculus
Description:ChEMBL_1288931
Residue:440
BDBM50245782
NameBDBM50245782
Synonyms:2-(4-((5-(4-isopropylphenyl)-1-methyl-1H-pyrazole-3-carboxamido)methyl)-2-methylphenoxy)-2-methylpropanoic acid | CHEMBL455157
TypeSmall organic molecule
Emp. Form.C26H31N3O4
Mol. Mass.449.542
SMILESCC(C)c1ccc(cc1)-c1cc(nn1C)C(=O)NCc1ccc(OC(C)(C)C(O)=O)c(C)c1