Reaction Details
TargetPeroxisome proliferator-activated receptor delta
LigandBDBM50245843
Substrate/Competitorn/a
Meas. Tech.ChEMBL_558114 (CHEMBL959043)
EC50>25000±n/a nM
Citation Martres, PFaucher, NLaroze, APineau, OFouchet, MHPotvain, FGrillot, DBeneton, V The discovery of equipotent PPARalpha/gamma dual activators. Bioorg Med Chem Lett18:6251-4 (2008) 
 
Peroxisome proliferator-activated receptor delta
Name:Peroxisome proliferator-activated receptor delta
Type:PROTEIN
Mol. Mass.:49719.14
Organism:Mus musculus
Description:ChEMBL_1288931
Residue:440
BDBM50245843
NameBDBM50245843
Synonyms:2-(4-((5-(4-tert-butylphenyl)-1-ethyl-1H-pyrazole-3-carboxamido)methyl)-2-methylphenoxy)-2-methylpropanoic acid | CHEMBL460278
TypeSmall organic molecule
Emp. Form.C28H35N3O4
Mol. Mass.477.5952
SMILESCCn1nc(cc1-c1ccc(cc1)C(C)(C)C)C(=O)NCc1ccc(OC(C)(C)C(O)=O)c(C)c1