Reaction Details
TargetPeroxisome proliferator-activated receptor alpha
LigandBDBM50245945
Substrate/Competitorn/a
Meas. Tech.ChEMBL_558113 (CHEMBL959042)
EC50 6000±n/a nM
Citation Martres, PFaucher, NLaroze, APineau, OFouchet, MHPotvain, FGrillot, DBeneton, V The discovery of equipotent PPARalpha/gamma dual activators. Bioorg Med Chem Lett18:6251-4 (2008) 
 
Peroxisome proliferator-activated receptor alpha
Name:Peroxisome proliferator-activated receptor alpha
Type:PROTEIN
Mol. Mass.:52343.28
Organism:Mus musculus
Description:ChEMBL_572395
Residue:468
BDBM50245945
NameBDBM50245945
Synonyms:2-(4-((1-allyl-5-(4-tert-butylphenyl)-1H-pyrazole-3-carboxamido)methyl)-2-methylphenoxy)-2-methylpropanoic acid | CHEMBL516964
TypeSmall organic molecule
Emp. Form.C29H35N3O4
Mol. Mass.489.6059
SMILESCc1cc(CNC(=O)c2cc(-c3ccc(cc3)C(C)(C)C)n(CC=C)n2)ccc1OC(C)(C)C(O)=O