Reaction Details
TargetcGMP-specific 3',5'-cyclic phosphodiesterase
LigandBDBM14392
Substrate/Competitorn/a
Meas. Tech.ChEMBL_558189 (CHEMBL962323)
IC50 1.3±n/a nM
Citation Bunnage, MEMathias, JPWood, AMiller, DStreet, SD Highly potent and selective chiral inhibitors of PDE5: an illustration of Pfeiffer's rule. Bioorg Med Chem Lett18:6033-6 (2008) 
 
cGMP-specific 3',5'-cyclic phosphodiesterase
Name:cGMP-specific 3',5'-cyclic phosphodiesterase
Type:Protein
Mol. Mass.:99975.83
Organism:Homo sapiens (Human)
Description:O76074
Residue:875
BDBM14392
NameBDBM14392
Synonyms:3-ethyl-5-{5-[(4-ethylpiperazine-1-)sulfonyl]-2-(2-methoxyethoxy)pyridin-3-yl}-2-(pyridin-2-ylmethyl)-2H,6H,7H-pyrazolo[4,3-d]pyrimidin-7-one Sildenafil Pyridyl Methyl Analogue 1
TypeSmall organic molecule
Emp. Form.C27H34N8O5S
Mol. Mass.582.674
SMILESCCN1CCN(CC1)S(=O)(=O)c1cnc(OCCOC)c(c1)-c1nc2c(CC)n(Cc3ccccn3)nc2c(=O)[nH]1