Reaction Details
TargetRod cGMP-specific 3',5'-cyclic phosphodiesterase subunit alpha
LigandBDBM50246539
Substrate/Competitorn/a
Meas. Tech.ChEMBL_558191 (CHEMBL962325)
IC50 1249±n/a nM
Citation Bunnage, MEMathias, JPWood, AMiller, DStreet, SD Highly potent and selective chiral inhibitors of PDE5: an illustration of Pfeiffer's rule. Bioorg Med Chem Lett18:6033-6 (2008) 
 
Rod cGMP-specific 3',5'-cyclic phosphodiesterase subunit alpha
Name:Rod cGMP-specific 3',5'-cyclic phosphodiesterase subunit alpha
Type:PROTEIN
Mol. Mass.:99670.72
Organism:Canis familiaris
Description:ChEMBL_558191
Residue:861
BDBM50246539
NameBDBM50246539
Synonyms:(R)-3-ethyl-5-(2-(1-methoxypropan-2-yloxy)-5-(4-propylpiperazin-1-ylsulfonyl)pyridin-3-yl)-2-methyl-2H-pyrazolo[4,3-d]pyrimidin-7(6H)-one | CHEMBL460294
TypeSmall organic molecule
Emp. Form.C24H35N7O5S
Mol. Mass.533.644
SMILESCCCN1CCN(CC1)S(=O)(=O)c1cnc(O[C@H](C)COC)c(c1)-c1nc2c(CC)n(C)nc2c(=O)[nH]1