Reaction Details
TargetRod cGMP-specific 3',5'-cyclic phosphodiesterase subunit alpha
LigandBDBM50246540
Substrate/Competitorn/a
Meas. Tech.ChEMBL_558191 (CHEMBL962325)
IC50 1539±n/a nM
Citation Bunnage, MEMathias, JPWood, AMiller, DStreet, SD Highly potent and selective chiral inhibitors of PDE5: an illustration of Pfeiffer's rule. Bioorg Med Chem Lett18:6033-6 (2008) 
 
Rod cGMP-specific 3',5'-cyclic phosphodiesterase subunit alpha
Name:Rod cGMP-specific 3',5'-cyclic phosphodiesterase subunit alpha
Type:PROTEIN
Mol. Mass.:99670.72
Organism:Canis familiaris
Description:ChEMBL_558191
Residue:861
BDBM50246540
NameBDBM50246540
Synonyms:(R)-3-ethyl-5-(5-(4-ethylpiperazin-1-ylsulfonyl)-2-(1-methoxypropan-2-yloxy)pyridin-3-yl)-2-(pyridin-2-ylmethyl)-2H-pyrazolo[4,3-d]pyrimidin-7(6H)-one | CHEMBL444157
TypeSmall organic molecule
Emp. Form.C28H36N8O5S
Mol. Mass.596.701
SMILESCCN1CCN(CC1)S(=O)(=O)c1cnc(O[C@H](C)COC)c(c1)-c1nc2c(CC)n(Cc3ccccn3)nc2c(=O)[nH]1