Reaction Details
TargetProtein-tyrosine kinase 2-beta
LigandBDBM50246095
Substrate/Competitorn/a
Meas. Tech.ChEMBL_558214 (CHEMBL960612)
IC50 1200±n/a nM
Citation Walker, DPBi, FCKalgutkar, ASBauman, JNZhao, SXSoglia, JRAspnes, GEKung, DWKlug-McLeod, JZawistoski, MPMcGlynn, MAOliver, RDunn, MLi, JCRichter, DTCooper, BAKath, JCHulford, CAAutry, CLLuzzio, MJUng, EJRoberts, WGBonnette, PCBuckbinder, LMistry, AGriffor, MCHan, SGuzman-Perez, A Trifluoromethylpyrimidine-based inhibitors of proline-rich tyrosine kinase 2 (PYK2): structure-activity relationships and strategies for the elimination of reactive metabolite formation. Bioorg Med Chem Lett18:6071-7 (2008) 
 
Protein-tyrosine kinase 2-beta
Name:Protein-tyrosine kinase 2-beta
Type:Protein
Mol. Mass.:115868.80
Organism:Homo sapiens (Human)
Description:Q14289
Residue:1009
BDBM50246095
NameBDBM50246095
Synonyms:CHEMBL470314 | N2-(1-methyl-1H-indol-5-yl)-N4-(pyridin-2-ylmethyl)-5-(trifluoromethyl)pyrimidine-2,4-diamine
TypeSmall organic molecule
Emp. Form.C20H17F3N6
Mol. Mass.398.3844
SMILESCn1ccc2cc(Nc3ncc(c(NCc4ccccn4)n3)C(F)(F)F)ccc12