Reaction Details
TargetProtein-tyrosine kinase 2-beta
LigandBDBM50246137
Substrate/Competitorn/a
Meas. Tech.ChEMBL_558214 (CHEMBL960612)
IC50 580±n/a nM
Citation Walker, DPBi, FCKalgutkar, ASBauman, JNZhao, SXSoglia, JRAspnes, GEKung, DWKlug-McLeod, JZawistoski, MPMcGlynn, MAOliver, RDunn, MLi, JCRichter, DTCooper, BAKath, JCHulford, CAAutry, CLLuzzio, MJUng, EJRoberts, WGBonnette, PCBuckbinder, LMistry, AGriffor, MCHan, SGuzman-Perez, A Trifluoromethylpyrimidine-based inhibitors of proline-rich tyrosine kinase 2 (PYK2): structure-activity relationships and strategies for the elimination of reactive metabolite formation. Bioorg Med Chem Lett18:6071-7 (2008) 
 
Protein-tyrosine kinase 2-beta
Name:Protein-tyrosine kinase 2-beta
Type:Protein
Mol. Mass.:115868.80
Organism:Homo sapiens (Human)
Description:Q14289
Residue:1009
BDBM50246137
NameBDBM50246137
Synonyms:5-(5-bromo-4-(pyridin-2-ylmethylamino)pyrimidin-2-ylamino)indolin-2-one | CHEMBL470316
TypeSmall organic molecule
Emp. Form.C18H15BrN6O
Mol. Mass.411.255
SMILESBrc1cnc(Nc2ccc3NC(=O)Cc3c2)nc1NCc1ccccn1