Reaction Details
TargetFocal adhesion kinase 1
LigandBDBM50246138
Substrate/Competitorn/a
Meas. Tech.ChEMBL_558213 (CHEMBL962347)
IC50 190±n/a nM
Citation Walker, DPBi, FCKalgutkar, ASBauman, JNZhao, SXSoglia, JRAspnes, GEKung, DWKlug-McLeod, JZawistoski, MPMcGlynn, MAOliver, RDunn, MLi, JCRichter, DTCooper, BAKath, JCHulford, CAAutry, CLLuzzio, MJUng, EJRoberts, WGBonnette, PCBuckbinder, LMistry, AGriffor, MCHan, SGuzman-Perez, A Trifluoromethylpyrimidine-based inhibitors of proline-rich tyrosine kinase 2 (PYK2): structure-activity relationships and strategies for the elimination of reactive metabolite formation. Bioorg Med Chem Lett18:6071-7 (2008) 
 
Focal adhesion kinase 1
Name:Focal adhesion kinase 1
Type:Tyrosine-protein kinase
Mol. Mass.:119233.17
Organism:Homo sapiens (Human)
Description:Q05397
Residue:1052
BDBM50246138
NameBDBM50246138
Synonyms:2-(2-oxoindolin-5-ylamino)-4-(pyridin-2-ylmethylamino)pyrimidine-5-carbonitrile | CHEMBL470317
TypeSmall organic molecule
Emp. Form.C19H15N7O
Mol. Mass.357.3687
SMILESO=C1Cc2cc(Nc3ncc(C#N)c(NCc4ccccn4)n3)ccc2N1