Reaction Details
TargetProtein-tyrosine kinase 2-beta
LigandBDBM50246138
Substrate/Competitorn/a
Meas. Tech.ChEMBL_558214 (CHEMBL960612)
IC50 1800±n/a nM
Citation Walker, DPBi, FCKalgutkar, ASBauman, JNZhao, SXSoglia, JRAspnes, GEKung, DWKlug-McLeod, JZawistoski, MPMcGlynn, MAOliver, RDunn, MLi, JCRichter, DTCooper, BAKath, JCHulford, CAAutry, CLLuzzio, MJUng, EJRoberts, WGBonnette, PCBuckbinder, LMistry, AGriffor, MCHan, SGuzman-Perez, A Trifluoromethylpyrimidine-based inhibitors of proline-rich tyrosine kinase 2 (PYK2): structure-activity relationships and strategies for the elimination of reactive metabolite formation. Bioorg Med Chem Lett18:6071-7 (2008) 
 
Protein-tyrosine kinase 2-beta
Name:Protein-tyrosine kinase 2-beta
Type:Protein
Mol. Mass.:115868.80
Organism:Homo sapiens (Human)
Description:Q14289
Residue:1009
BDBM50246138
NameBDBM50246138
Synonyms:2-(2-oxoindolin-5-ylamino)-4-(pyridin-2-ylmethylamino)pyrimidine-5-carbonitrile | CHEMBL470317
TypeSmall organic molecule
Emp. Form.C19H15N7O
Mol. Mass.357.3687
SMILESO=C1Cc2cc(Nc3ncc(C#N)c(NCc4ccccn4)n3)ccc2N1