Reaction Details
TargetFocal adhesion kinase 1
LigandBDBM50246329
Substrate/Competitorn/a
Meas. Tech.ChEMBL_558213 (CHEMBL962347)
IC50 3900±n/a nM
Citation Walker, DPBi, FCKalgutkar, ASBauman, JNZhao, SXSoglia, JRAspnes, GEKung, DWKlug-McLeod, JZawistoski, MPMcGlynn, MAOliver, RDunn, MLi, JCRichter, DTCooper, BAKath, JCHulford, CAAutry, CLLuzzio, MJUng, EJRoberts, WGBonnette, PCBuckbinder, LMistry, AGriffor, MCHan, SGuzman-Perez, A Trifluoromethylpyrimidine-based inhibitors of proline-rich tyrosine kinase 2 (PYK2): structure-activity relationships and strategies for the elimination of reactive metabolite formation. Bioorg Med Chem Lett18:6071-7 (2008) 
 
Focal adhesion kinase 1
Name:Focal adhesion kinase 1
Type:Tyrosine-protein kinase
Mol. Mass.:119233.17
Organism:Homo sapiens (Human)
Description:Q05397
Residue:1052
BDBM50246329
NameBDBM50246329
Synonyms:3-(4-((1R,2R)-2-(dimethylamino)cyclopentylamino)-5-(trifluoromethyl)pyrimidin-2-ylamino)-N,N-dimethylbenzamide | CHEMBL453649
TypeSmall organic molecule
Emp. Form.C21H27F3N6O
Mol. Mass.436.4739
SMILESCN(C)[C@@H]1CCC[C@H]1Nc1nc(Nc2cccc(c2)C(=O)N(C)C)ncc1C(F)(F)F