Reaction Details
TargetFocal adhesion kinase 1
LigandBDBM50246379
Substrate/Competitorn/a
Meas. Tech.ChEMBL_558213 (CHEMBL962347)
IC50>650±n/a nM
Citation Walker, DPBi, FCKalgutkar, ASBauman, JNZhao, SXSoglia, JRAspnes, GEKung, DWKlug-McLeod, JZawistoski, MPMcGlynn, MAOliver, RDunn, MLi, JCRichter, DTCooper, BAKath, JCHulford, CAAutry, CLLuzzio, MJUng, EJRoberts, WGBonnette, PCBuckbinder, LMistry, AGriffor, MCHan, SGuzman-Perez, A Trifluoromethylpyrimidine-based inhibitors of proline-rich tyrosine kinase 2 (PYK2): structure-activity relationships and strategies for the elimination of reactive metabolite formation. Bioorg Med Chem Lett18:6071-7 (2008) 
 
Focal adhesion kinase 1
Name:Focal adhesion kinase 1
Type:Tyrosine-protein kinase
Mol. Mass.:119233.17
Organism:Homo sapiens (Human)
Description:Q05397
Residue:1052
BDBM50246379
NameBDBM50246379
Synonyms:CHEMBL452342 | N4-((1R,2R)-2-Dimethylamino-cyclopentyl)-N2-(2,2-dioxo-2,3-dihydro-1H-2lambda6-benzo[c]isothiazol-5-yl)-5-trifluoromethyl-pyrimidine-2,4-diamine
TypeSmall organic molecule
Emp. Form.C19H23F3N6O2S
Mol. Mass.456.485
SMILESCN(C)[C@@H]1CCC[C@H]1Nc1nc(Nc2ccc3NS(=O)(=O)Cc3c2)ncc1C(F)(F)F