Reaction Details
TargetHistone deacetylase 3
LigandBDBM50232005
Substrate/Competitorn/a
Meas. Tech.ChEMBL_493108 (CHEMBL940371)
IC50>50000±n/a nM
Citation Methot, JLHamblett, CLMampreian, DMJung, JHarsch, ASzewczak, AADahlberg, WKMiddleton, REHughes, BFleming, JCWang, HKral, AMOzerova, NCruz, JCHaines, BChenard, MKenific, CMSecrist, JPMiller, TA SAR profiles of spirocyclic nicotinamide derived selective HDAC1/HDAC2 inhibitors (SHI-1:2). Bioorg Med Chem Lett18:6104-9 (2008) 
 
Histone deacetylase 3
Name:Histone deacetylase 3
Type:Enzyme
Mol. Mass.:48829.55
Organism:Homo sapiens (Human)
Description:O15379
Residue:428
BDBM50232005
NameBDBM50232005
Synonyms:CHEMBL269935 N-(4-hydroxybiphenyl-3-yl)benzamide
TypeSmall organic molecule
Emp. Form.C19H15NO2
Mol. Mass.289.3279
SMILESOc1ccc(cc1NC(=O)c1ccccc1)-c1ccccc1