Reaction Details
TargetHistone deacetylase 3
LigandBDBM50232034
Substrate/Competitorn/a
Meas. Tech.ChEMBL_493108 (CHEMBL940371)
IC50 7300±n/a nM
Citation Methot, JLHamblett, CLMampreian, DMJung, JHarsch, ASzewczak, AADahlberg, WKMiddleton, REHughes, BFleming, JCWang, HKral, AMOzerova, NCruz, JCHaines, BChenard, MKenific, CMSecrist, JPMiller, TA SAR profiles of spirocyclic nicotinamide derived selective HDAC1/HDAC2 inhibitors (SHI-1:2). Bioorg Med Chem Lett18:6104-9 (2008) 
 
Histone deacetylase 3
Name:Histone deacetylase 3
Type:Enzyme
Mol. Mass.:48829.55
Organism:Homo sapiens (Human)
Description:O15379
Residue:428
BDBM50232034
NameBDBM50232034
Synonyms:CHEMBL256440 | N-(2-amino-5-(thiophen-2-yl)phenyl)nicotinamide
TypeSmall organic molecule
Emp. Form.C16H13N3OS
Mol. Mass.295.359
SMILESNc1ccc(cc1NC(=O)c1cccnc1)-c1cccs1