Reaction Details
TargetHistone deacetylase 1
LigandBDBM50275886
Substrate/Competitorn/a
Meas. Tech.ChEMBL_493106 (CHEMBL940369)
IC50 14±n/a nM
Citation Methot, JLHamblett, CLMampreian, DMJung, JHarsch, ASzewczak, AADahlberg, WKMiddleton, REHughes, BFleming, JCWang, HKral, AMOzerova, NCruz, JCHaines, BChenard, MKenific, CMSecrist, JPMiller, TA SAR profiles of spirocyclic nicotinamide derived selective HDAC1/HDAC2 inhibitors (SHI-1:2). Bioorg Med Chem Lett18:6104-9 (2008) 
 
Histone deacetylase 1
Name:Histone deacetylase 1
Type:Enzyme
Mol. Mass.:55090.27
Organism:Homo sapiens (Human)
Description:Q13547
Residue:482
BDBM50275886
NameBDBM50275886
Synonyms:8-(5-(2-amino-5-(thiophen-2-yl)phenylcarbamoyl)pyridin-2-yl)-N-ethyl-2,8-diazaspiro[4.5]decane-2-carboxamide | CHEMBL470581
TypeSmall organic molecule
Emp. Form.C27H32N6O2S
Mol. Mass.504.647
SMILESCCNC(=O)N1CCC2(C1)CCN(CC2)c1ccc(cn1)C(=O)Nc1cc(ccc1N)-c1cccs1