Reaction Details
TargetHistone deacetylase 1
LigandBDBM50275362
Substrate/Competitorn/a
Meas. Tech.ChEMBL_493106 (CHEMBL940369)
IC50 27±n/a nM
Citation Methot, JLHamblett, CLMampreian, DMJung, JHarsch, ASzewczak, AADahlberg, WKMiddleton, REHughes, BFleming, JCWang, HKral, AMOzerova, NCruz, JCHaines, BChenard, MKenific, CMSecrist, JPMiller, TA SAR profiles of spirocyclic nicotinamide derived selective HDAC1/HDAC2 inhibitors (SHI-1:2). Bioorg Med Chem Lett18:6104-9 (2008) 
 
Histone deacetylase 1
Name:Histone deacetylase 1
Type:Enzyme
Mol. Mass.:55090.27
Organism:Homo sapiens (Human)
Description:Q13547
Residue:482
BDBM50275362
NameBDBM50275362
Synonyms:CHEMBL521193 | N-(2-amino-5-(thiophen-2-yl)phenyl)-6-(4-oxo-1-phenyl-1,3,8-triazaspiro[4.5]decan-8-yl)nicotinamide
TypeSmall organic molecule
Emp. Form.C29H28N6O2S
Mol. Mass.524.637
SMILESNc1ccc(cc1NC(=O)c1ccc(nc1)N1CCC2(CC1)N(CNC2=O)c1ccccc1)-c1cccs1