Reaction Details
TargetHistone deacetylase 3
LigandBDBM50275770
Substrate/Competitorn/a
Meas. Tech.ChEMBL_493108 (CHEMBL940371)
IC50 1260000±n/a nM
Citation Methot, JLHamblett, CLMampreian, DMJung, JHarsch, ASzewczak, AADahlberg, WKMiddleton, REHughes, BFleming, JCWang, HKral, AMOzerova, NCruz, JCHaines, BChenard, MKenific, CMSecrist, JPMiller, TA SAR profiles of spirocyclic nicotinamide derived selective HDAC1/HDAC2 inhibitors (SHI-1:2). Bioorg Med Chem Lett18:6104-9 (2008) 
 
Histone deacetylase 3
Name:Histone deacetylase 3
Type:Enzyme
Mol. Mass.:48829.55
Organism:Homo sapiens (Human)
Description:O15379
Residue:428
BDBM50275770
NameBDBM50275770
Synonyms:CHEMBL513568 | N-(2-amino-5-(thiophen-2-yl)phenyl)-6-(2,8-diazaspiro[4.5]decan-8-yl)nicotinamide
TypeSmall organic molecule
Emp. Form.C24H27N5OS
Mol. Mass.433.569
SMILESNc1ccc(cc1NC(=O)c1ccc(nc1)N1CCC2(CCNC2)CC1)-c1cccs1