Reaction Details
TargetPotassium voltage-gated channel subfamily H member 2
LigandBDBM50275986
Substrate/Competitorn/a
Meas. Tech.ChEMBL_493154 (CHEMBL944326)
EC50 10000±n/a nM
Citation Methot, JLHamblett, CLMampreian, DMJung, JHarsch, ASzewczak, AADahlberg, WKMiddleton, REHughes, BFleming, JCWang, HKral, AMOzerova, NCruz, JCHaines, BChenard, MKenific, CMSecrist, JPMiller, TA SAR profiles of spirocyclic nicotinamide derived selective HDAC1/HDAC2 inhibitors (SHI-1:2). Bioorg Med Chem Lett18:6104-9 (2008) 
 
Potassium voltage-gated channel subfamily H member 2
Name:Potassium voltage-gated channel subfamily H member 2
Type:Multi-pass membrane protein
Mol. Mass.:126672.65
Organism:Homo sapiens (Human)
Description:Q12809
Residue:1159
BDBM50275986
NameBDBM50275986
Synonyms:6-(2-acetyl-2,7-diazaspiro[4.5]decan-7-yl)-N-(2-amino-5-(thiophen-2-yl)phenyl)nicotinamide | CHEMBL471399
TypeSmall organic molecule
Emp. Form.C26H29N5O2S
Mol. Mass.475.606
SMILESCC(=O)N1CCC2(C1)CCCN(C2)c1ccc(cn1)C(=O)Nc1cc(ccc1N)-c1cccs1