Reaction Details
TargetPotassium voltage-gated channel subfamily H member 2
LigandBDBM50275941
Substrate/Competitorn/a
Meas. Tech.ChEMBL_493154 (CHEMBL944326)
EC50 6500±n/a nM
Citation Methot, JLHamblett, CLMampreian, DMJung, JHarsch, ASzewczak, AADahlberg, WKMiddleton, REHughes, BFleming, JCWang, HKral, AMOzerova, NCruz, JCHaines, BChenard, MKenific, CMSecrist, JPMiller, TA SAR profiles of spirocyclic nicotinamide derived selective HDAC1/HDAC2 inhibitors (SHI-1:2). Bioorg Med Chem Lett18:6104-9 (2008) 
 
Potassium voltage-gated channel subfamily H member 2
Name:Potassium voltage-gated channel subfamily H member 2
Type:Multi-pass membrane protein
Mol. Mass.:126672.65
Organism:Homo sapiens (Human)
Description:Q12809
Residue:1159
BDBM50275941
NameBDBM50275941
Synonyms:CHEMBL513250 | N-(2-amino-5-(thiophen-2-yl)phenyl)-6-(2-(2-hydroxyethyl)-2,8-diazaspiro[4.5]decan-8-yl)nicotinamide
TypeSmall organic molecule
Emp. Form.C26H31N5O2S
Mol. Mass.477.622
SMILESNc1ccc(cc1NC(=O)c1ccc(nc1)N1CCC2(CCN(CCO)C2)CC1)-c1cccs1