Reaction Details
TargetAmine oxidase [flavin-containing] A
LigandBDBM50273529
Substrate/Competitorn/a
Meas. Tech.ChEMBL_536001 (CHEMBL988017)
Ki 6.5±n/a nM
Citation La Regina, GSilvestri, RGatti, VLavecchia, ANovellino, EBefani, OTurini, PAgostinelli, E Synthesis, structure-activity relationships and molecular modeling studies of new indole inhibitors of monoamine oxidases A and B. Bioorg Med Chem16:9729-40 (2008) 
 
Amine oxidase [flavin-containing] A
Name:Amine oxidase [flavin-containing] A
Type:PROTEIN
Mol. Mass.:59764.63
Organism:Bos taurus
Description:ChEMBL_1501477
Residue:527
BDBM50273529
NameBDBM50273529
Synonyms:CHEMBL503807 | N-Methyl,N-(2-phenylethyl)-1-methyl-1H-indole-2-carboxamide
TypeSmall organic molecule
Emp. Form.C19H20N2O
Mol. Mass.292.3749
SMILESCN(CCc1ccccc1)C(=O)c1cc2ccccc2n1C