Reaction Details
TargetAmine oxidase [flavin-containing] A
LigandBDBM50273530
Substrate/Competitorn/a
Meas. Tech.ChEMBL_536001 (CHEMBL988017)
Ki 5±n/a nM
Citation La Regina, GSilvestri, RGatti, VLavecchia, ANovellino, EBefani, OTurini, PAgostinelli, E Synthesis, structure-activity relationships and molecular modeling studies of new indole inhibitors of monoamine oxidases A and B. Bioorg Med Chem16:9729-40 (2008) 
 
Amine oxidase [flavin-containing] A
Name:Amine oxidase [flavin-containing] A
Type:PROTEIN
Mol. Mass.:59764.63
Organism:Bos taurus
Description:ChEMBL_1501477
Residue:527
BDBM50273530
NameBDBM50273530
Synonyms:CHEMBL460609 | N-(3-Phenylpropyl)-1H-indole-2-carboxamide
TypeSmall organic molecule
Emp. Form.C18H18N2O
Mol. Mass.278.3483
SMILESO=C(NCCCc1ccccc1)c1cc2ccccc2[nH]1