Reaction Details
TargetAmine oxidase [flavin-containing] A
LigandBDBM50273491
Substrate/Competitorn/a
Meas. Tech.ChEMBL_536001 (CHEMBL988017)
Ki 6±n/a nM
Citation La Regina, GSilvestri, RGatti, VLavecchia, ANovellino, EBefani, OTurini, PAgostinelli, E Synthesis, structure-activity relationships and molecular modeling studies of new indole inhibitors of monoamine oxidases A and B. Bioorg Med Chem16:9729-40 (2008) 
 
Amine oxidase [flavin-containing] A
Name:Amine oxidase [flavin-containing] A
Type:PROTEIN
Mol. Mass.:59764.63
Organism:Bos taurus
Description:ChEMBL_1501477
Residue:527
BDBM50273491
NameBDBM50273491
Synonyms:CHEMBL444747 | N-Benzyl,N-methyl-1-methyl-1H-indole-2-carboxamide
TypeSmall organic molecule
Emp. Form.C18H18N2O
Mol. Mass.278.3483
SMILESCN(Cc1ccccc1)C(=O)c1cc2ccccc2n1C